{"text_format":"1","workbook":"xlsx","n_sheets":11,"sheets":["Report Generator","Report","Control","Report Template","Preview","NEC Report Template","Report Temp","Chart Template","Version History","Sample Data","NEC"],"not_rendered":{"charts":17,"images":2,"macros":1,"external_links":0,"defined_names":553,"comments":0,"pivot_tables":0},"unopened":[],"bounds":{"document_bytes":16777216,"sheet_cells":100000,"rows_first":2000,"rows_last":500,"rows_between":2000,"halvings":0,"cell_chars":16384,"cell_head_chars":4096},"cells_cut":0,"cells_raw":0,"read":"whole","date_system":"1900"}

{"sheet":"Report Generator","index":0,"n_rows":8,"n_cols":2,"rows_kept":8,"cut":false,"hidden":false,"merged":[]}
[]
[]
[]
[]
[null,"This macro is provided free of charge \"as is\" to assist users in interpreting data from the Metsys Current Logger. "]
[null,"No warranties, either express or implied, are made regarding this macro, including but not limited to, warranties of fitness for any particular purpose. "]
[null,"Users are solely responsible for any decisions based on the reports generated by this macro. "]
[null,"GMC-I PROSyS Ltd. shall not be liable for any loss or damage, however caused, resulting from the use of this macro."]

{"sheet":"Report","index":1,"n_rows":52,"n_cols":13,"rows_kept":52,"cut":false,"hidden":true,"merged":[[44,1,44,7],[51,11,51,12],[5,8,5,11],[6,8,6,11],[7,8,7,11],[8,8,8,11],[9,8,9,11],[35,11,38,11],[37,8,37,10],[0,1,0,11],[2,2,2,3],[2,8,2,11],[3,2,3,3],[3,8,3,11],[4,8,4,11]]}
[null,"BB1"]
[]
[null,"Start Time","2024-04-23T09:35:00",null,null,null,null,"Location","Bull's Head"]
[null,"End Time","2024-04-30T15:15:34"]
[null,"Duration",null,7.2399769999999997,null,"hours"]
[null,"Log Interval",null,5,null,"minutes"]
[null,null,null,null,null,null,null,"Circuit Desc.","panel 1"]
[null,null,null,null,null,null,null,"Applicable regs.","BS"]
[null,null,null,null,null,null,null,"No. of Poles",3]
[null,"Readings",null,2085,null,null,null,"Source","240423-Bulls_00013_240423_0935.csv"]
[]
[]
[]
[]
[]
[]
[]
[]
[]
[]
[]
[]
[]
[]
[]
[]
[]
[]
[]
[]
{"$rows_left_out":23}
{"sheet":"Control","index":2,"n_rows":62,"n_cols":17,"rows_kept":62,"cut":false,"hidden":true,"merged":[]}
[]
[]
[]
[]
[null,"Report Generator Mode",1,null,null,"0 - RG, 1 - NEC"]
[null,"Rolling Data Present",false]
[null,"Step",1]
[null,"Title"]
[null,"Job ID"]
[]
[null,"Location",null,null,null,"Circuit Description"]
[null,null,null,null,null,"Standard"]
[null,null,null,null,null,"No. of Poles",1]
[]
[]
[null,"Type",0]
[null,"Phase Colours",2,null,null,"NB. 2 = (black, red, blue). This cannot currently be changed in NEC mode"]
[]
[null,"Log File Name","<none>"]
[null,"Start Time","2024-04-23T09:35:00"]
[null,"End Time","2024-04-30T15:15:34"]
[null,"Duration",7.2399769999999997,"hours"]
[null,"Readings",2085]
[null,"Phases",3]
[null,"Log Interval",5,"minutes"]
[]
[null,"Chart Start",{"$f":"FLOOR(start_time*24, 1)/24","v":"2024-04-23T09:00:00"},null,null,{"$f":"chart_start","v":45405.375}]
[null,"Chart End",{"$f":"CEILING(end_time*24, 1)/24","v":"2024-04-30T16:00:00"},null,null,{"$f":"chart_end","v":45412.666666666664}]
[null,"Chart Duration (days)",{"$f":"chart_end-chart_start","v":7.2916666666642413},"hours",null,17520,8760,2184,720,168,48,24,12,6,2,1,"hours"]
[null,"Calculated Grid (days)",{"$f":"C29/4","v":1.8229166666660603},null,null,{"$f":"F29/24","v":730},365,{"$f":"H29/24","v":91},30,{"$f":"J29/24","v":7},2,1,0.5,0.25,8.3333333333333329E-2,4.1666666666666664E-2,"days"]
{"$rows_left_out":33}
{"sheet":"Report Template","index":3,"n_rows":51,"n_cols":26,"rows_kept":51,"cut":false,"hidden":true,"merged":[[50,11,50,12],[9,1,9,11],[0,1,0,11],[1,14,1,22],[1,26,1,33],[2,8,3,11],[3,2,3,3],[4,2,4,3]]}
[null,"Sample Report"]
[]
[null,"Job ID",null,null,null,null,null,"Location","1 Potter Place, West Pimbo, Skelmersdale, Lancashire, WN8 9PH, UK"]
[null,"Start Time","2017-07-01T00:06:32"]
[null,"End Time","2017-07-03T23:56:32",null,null,null,null,"Source"]
[null,"Duration",null,3,null,"hours",null,"Type","pre-install"]
[null,"Log Interval",null,10,null,"minutes",null,"Phases",4]
[null,null,null,null,null,null,null,"Readings",432]
[]
[null,"Survey carried out over 3 days prior to installation of new equipment."]
[null,"3hr Maximum Continuous Load"]
[null,null,"A","B",null,"C",null,"N"]
[null,null,0,0,null,0,null,0]
[]
[]
[]
[]
[]
[]
[]
[null,null,null,null,null,null,null,null,null,null,null,null,null,null,"Max",null,null,null,null,null,null,null,null,null,null,"Max"]
[null,null,null,null,null,null,null,null,null,null,null,null,null,null,"Mean",null,null,null,null,null,null,null,null,null,null,"Mean"]
[null,null,null,null,null,null,null,null,null,null,null,null,null,null,"Min",null,null,null,null,null,null,null,null,null,null,"Min"]
[null,null,null,null,null,null,null,null,null,null,null,null,null,null,"Median",null,null,null,null,null,null,null,null,null,null,"Median"]
[null,null,null,null,null,null,null,null,null,null,null,null,null,null,"Stdev",null,null,null,null,null,null,null,null,null,null,"Stdev"]
[]
[]
[]
[]
[]
{"$rows_left_out":22}
{"sheet":"Preview","index":4,"n_rows":0,"n_cols":0,"rows_kept":0,"cut":false,"hidden":true,"merged":[]}

{"sheet":"NEC Report Template","index":5,"n_rows":52,"n_cols":13,"rows_kept":52,"cut":false,"hidden":true,"merged":[[35,11,38,11],[51,11,51,12],[0,1,0,11],[2,2,2,3],[3,2,3,3],[37,8,37,10],[2,8,2,11],[3,8,3,11],[4,8,4,11],[5,8,5,11],[9,8,9,11],[44,1,44,7],[6,8,6,11],[7,8,7,11],[8,8,8,11]]}
[null,"Sample Report"]
[]
[null,"Start Time","2017-07-01T00:06:32",null,null,null,null,"Location","1 Potter Place, West Pimbo, Skelmersdale, Lancashire, WN8 9PH, UK"]
[null,"End Time","2017-07-03T23:56:32"]
[null,"Duration",null,3,null,"hours"]
[null,"Log Interval",null,10,null,"minutes"]
[null,null,null,null,null,null,null,"Circuit Desc."]
[null,null,null,null,null,null,null,"Applicable regs."]
[null,null,null,null,null,null,null,"No. of Poles"]
[null,"Readings",null,432,null,null,null,"Source"]
[]
[]
[]
[]
[]
[]
[]
[]
[]
[]
[]
[]
[]
[]
[]
[]
[]
[]
[]
[]
{"$rows_left_out":23}
{"sheet":"Report Temp","index":6,"n_rows":49,"n_cols":26,"rows_kept":49,"cut":false,"hidden":true,"merged":[[9,1,9,11],[48,11,48,12],[0,1,0,11],[1,14,1,22],[1,26,1,33],[2,8,3,11],[3,2,3,3],[4,2,4,3]]}
[null,"Sample Report"]
[]
[null,"Job ID",null,null,null,null,null,"Location","1 Potter Place, West Pimbo, Skelmersdale, Lancashire, WN8 9PH, UK"]
[null,"Start Time","2017-07-01T00:06:32"]
[null,"End Time","2017-07-03T23:56:32",null,null,null,null,"Source"]
[null,"Duration",null,3,null,"hours",null,"Type","pre-install"]
[null,"Log Interval",null,10,null,"minutes",null,"Phases",4]
[null,null,null,null,null,null,null,"Readings",432]
[]
[null,"Survey carried out over 3 days prior to installation of new equipment."]
[null,"3hr Maximum Continuous Load"]
[null,null,"A","B",null,"C",null,"N"]
[null,null,0,0,null,0,null,0]
[]
[]
[]
[]
[]
[]
[null,null,null,null,null,null,null,null,null,null,null,null,null,null,"Max",null,null,null,null,null,null,null,null,null,null,"Max"]
[null,null,null,null,null,null,null,null,null,null,null,null,null,null,"Mean",null,null,null,null,null,null,null,null,null,null,"Mean"]
[null,null,null,null,null,null,null,null,null,null,null,null,null,null,"Min",null,null,null,null,null,null,null,null,null,null,"Min"]
[null,null,null,null,null,null,null,null,null,null,null,null,null,null,"Median",null,null,null,null,null,null,null,null,null,null,"Median"]
[null,null,null,null,null,null,null,null,null,null,null,null,null,null,"Stdev",null,null,null,null,null,null,null,null,null,null,"Stdev"]
[]
[]
[]
[]
[]
[]
{"$rows_left_out":20}
{"sheet":"Chart Template","index":7,"n_rows":2,"n_cols":13,"rows_kept":2,"cut":false,"hidden":true,"merged":[]}
["Templates for charts in reports",null,null,null,null,null,null,null,null,null,null,null,"Templates for charts in preview window"]
["NB. changing chart series line colours programatically to RGB values does not work properly in Excel 2013 (get random colours & points change too)! - having to use a different template here per colour scheme!"]

{"sheet":"Version History","index":8,"n_rows":5,"n_cols":3,"rows_kept":5,"cut":false,"hidden":false,"merged":[]}
["Version","Date"]
[1.02,"2024-08-30","Initial Version"]
[1.03,"2024-10-23","Now includes Voltage input and estimated Apparent Power"]
[1.04,"2025-01-20","Minor changes and bug fixes"]
[1.05,"2025-01-22","Modified Maximum Demand (Total Power) formula. Added Free Capacity calculation. Removed Base Load. Added units to the tables."]

{"sheet":"Sample Data","index":9,"n_rows":2086,"n_cols":67,"rows_kept":2086,"cut":false,"hidden":true,"merged":[]}
["Time","IA Avg","IB Avg","IC Avg","IN Avg","IA Min","IB Min","IC Min","IN Min","IA Max","IB Max","IC Max","IN Max","IAvg Sum",null,null,null,null,null,null,null,"IA Pk-Avg","IB Pk-Avg","IC Pk-Avg","IN Pk-Avg",null,null,null,{"$f":"B1","v":"IA Avg"},{"$f":"C1","v":"IB Avg"},"IC Avg","IN Avg","IA Min","IB Min","IC Min","IN Min","IA Max","IB Max","IC Max","IN Max","IAvg Sum",0,0,0,0,0,0,0,"IA Pk-Avg","IB Pk-Avg","IC Pk-Avg","IN Pk-Avg","limit1","limit2","Current Rating",null,"80% Line",null,"Max CL",null,"AMAD",null,"Seasonal",null,"Projected Demand",null,"Time"]
["2024-04-23T09:35:00",10,14,34,0,7,3,24,0,14,28,41,0,{"$f":"SUM(B2:D2)","v":58},null,null,null,null,null,null,null,{"$f":"connected_load_plot+J2-B2","v":46},{"$f":"connected_load_plot+K2-C2","v":56},{"$f":"connected_load_plot+L2-D2","v":49},{"$f":"0","v":0},null,null,"Max",{"$f":"MAX(B2:B2086)","v":27},{"$f":"MAX(C2:C2086)","v":28},42,0,18,16,33,0,46,49,66,0,80,0,0,0,0,0,0,0,68,68,75,0,0,0,{"$f":"panel_capacity","v":200},{"$f":"temp_rating_desc","v":"90% of Rating (40C)"},{"$f":"nec_80_percent","v":180},"Maximum Continuous Load (MCL)",40,"Adjusted Maximum Average Demand (+25%) AMAD",50,"AMCL + Seasonal",{"$f":"nec_seasonal_plot","v":0},"Projected Demand",{"$f":"connected_load_plot","v":42},null,"2024-04-23T09:00:00"]
["2024-04-23T09:40:00",10,16,32,0,7,3,25,0,20,28,42,0,{"$f":"SUM(B3:D3)","v":58},null,null,null,null,null,null,null,{"$f":"connected_load_plot+J3-B3","v":52},{"$f":"connected_load_plot+K3-C3","v":54},{"$f":"connected_load_plot+L3-D3","v":52},{"$f":"0","v":0},null,null,"Mean",{"$f":"AVERAGE(B2:B2086)","v":12.410551558752998},{"$f":"AVERAGE(C2:C2086)","v":10.006235011990407},22.881055155875298,0,5.8657074340527577,3.4441247002398083,14.796642685851319,0,21.780815347721823,20.448920863309354,33.817266187050357,0,45.297841726618707,{"$error":"#DIV/0!"},{"$error":"#DIV/0!"},{"$error":"#DIV/0!"},{"$error":"#DIV/0!"},{"$error":"#DIV/0!"},{"$error":"#DIV/0!"},{"$error":"#DIV/0!"},51.370263788968828,52.442685851318942,52.936211031175063,0,{"$f":"limit_val1","v":0},{"$f":"limit2_val","v":0},{"$f":"BC2","v":200},null,{"$f":"BE2","v":180},null,40,null,50,null,{"$f":"BK2","v":0},null,42,null,"2024-04-30T16:00:00"]
["2024-04-23T09:45:00",8,16,34,0,6,3,26,0,14,28,43,0,58,null,null,null,null,null,null,null,{"$f":"connected_load_plot+J4-B4","v":48},{"$f":"connected_load_plot+K4-C4","v":54},{"$f":"connected_load_plot+L4-D4","v":51},{"$f":"0","v":0},null,null,"Min",{"$f":"MIN(B2:B2086)","v":4},{"$f":"MIN(C2:C2086)","v":2},4,0,2,1,4,0,8,5,6,0,15,0,0,0,0,0,0,0,44,44,43,0]
["2024-04-23T09:50:00",9,14,35,0,6,3,26,0,19,28,49,0,58,null,null,null,null,null,null,null,{"$f":"connected_load_plot+J5-B5","v":52},{"$f":"connected_load_plot+K5-C5","v":56},{"$f":"connected_load_plot+L5-D5","v":56},{"$f":"0","v":0},null,null,"Median",{"$f":"MEDIAN(B2:B2086)","v":12},{"$f":"MEDIAN(C2:C2086)","v":9},25,0,5,3,16,0,22,20,36,0,47,{"$error":"#NUM!"},{"$error":"#NUM!"},{"$error":"#NUM!"},{"$error":"#NUM!"},{"$error":"#NUM!"},{"$error":"#NUM!"},{"$error":"#NUM!"},51,52,53,0]
["2024-04-23T09:55:00",8,14,31,0,6,3,26,0,14,28,37,0,53,null,null,null,null,null,null,null,{"$f":"connected_load_plot+J6-B6","v":48},{"$f":"connected_load_plot+K6-C6","v":56},{"$f":"connected_load_plot+L6-D6","v":48},{"$f":"0","v":0},null,null,"Stdev",{"$f":"_xlfn.STDEV.P(B2:B2086)","v":4.3450993848941915},{"$f":"_xlfn.STDEV.P(C2:C2086)","v":4.3371640849390785},8.6998029603271227,0,2.8733788532508631,2.6189441304752132,7.0894178070945726,0,6.974115644542862,6.9702970382825766,10.655525771013009,0,12.065131802587093,{"$error":"#DIV/0!"},{"$error":"#DIV/0!"},{"$error":"#DIV/0!"},{"$error":"#DIV/0!"},{"$error":"#DIV/0!"},{"$error":"#DIV/0!"},{"$error":"#DIV/0!"},3.8003001493802322,4.0427215563733432,4.2056554402476305,0,null,null,null,null,null,null,"MAD",null,null,null,null,null,"Continuous Load"]
["2024-04-23T10:00:00",8,17,35,0,5,3,26,0,14,28,44,0,60,null,null,null,null,null,null,null,{"$f":"connected_load_plot+J7-B7","v":48},{"$f":"connected_load_plot+K7-C7","v":53},{"$f":"connected_load_plot+L7-D7","v":51},{"$f":"0","v":0},null,null,null,null,null,null,null,null,null,null,null,null,null,null,null,null,null,null,null,null,null,null,null,null,null,null,null,null,null,null,null,null,"Current Demand (CD)",{"$f":"mad_plot","v":42},null,null,null,null,"CONTINUOUS LOAD",{"$f":"continuous_load_plot","v":40}]
["2024-04-23T10:05:00",14,17,35,0,5,3,26,0,27,28,44,0,66,null,null,null,null,null,null,null,{"$f":"connected_load_plot+J8-B8","v":55},{"$f":"connected_load_plot+K8-C8","v":53},{"$f":"connected_load_plot+L8-D8","v":51},{"$f":"0","v":0},null,null,null,null,null,null,null,null,null,null,null,null,null,null,null,null,null,null,null,null,null,null,null,null,null,null,null,null,null,null,null,null,null,{"$f":"BG7","v":42},null,null,null,null,null,{"$f":"BM7","v":40}]
["2024-04-23T10:10:00",8,17,32,0,6,4,25,0,21,36,43,0,57,null,null,null,null,null,null,null,{"$f":"connected_load_plot+J9-B9","v":55},{"$f":"connected_load_plot+K9-C9","v":61},{"$f":"connected_load_plot+L9-D9","v":53},{"$f":"0","v":0}]
["2024-04-23T10:15:00",8,15,30,0,6,4,25,0,19,29,39,0,53,null,null,null,null,null,null,null,{"$f":"connected_load_plot+J10-B10","v":53},{"$f":"connected_load_plot+K10-C10","v":56},{"$f":"connected_load_plot+L10-D10","v":51},{"$f":"0","v":0}]
["2024-04-23T10:20:00",7,17,35,0,6,4,26,0,13,23,43,0,59,null,null,null,null,null,null,null,{"$f":"connected_load_plot+J11-B11","v":48},{"$f":"connected_load_plot+K11-C11","v":48},{"$f":"connected_load_plot+L11-D11","v":50},{"$f":"0","v":0}]
["2024-04-23T10:25:00",12,17,38,0,6,4,26,0,26,30,47,0,67,null,null,null,null,null,null,null,{"$f":"connected_load_plot+J12-B12","v":56},{"$f":"connected_load_plot+K12-C12","v":55},{"$f":"connected_load_plot+L12-D12","v":51},{"$f":"0","v":0},null,null,"Max"]
["2024-04-23T10:30:00",7,14,32,0,6,4,26,0,13,29,39,0,53,null,null,null,null,null,null,null,{"$f":"connected_load_plot+J13-B13","v":48},{"$f":"connected_load_plot+K13-C13","v":57},{"$f":"connected_load_plot+L13-D13","v":49},{"$f":"0","v":0}]
["2024-04-23T10:35:00",9,16,34,0,6,4,26,0,19,30,44,0,59,null,null,null,null,null,null,null,{"$f":"connected_load_plot+J14-B14","v":52},{"$f":"connected_load_plot+K14-C14","v":56},{"$f":"connected_load_plot+L14-D14","v":52},{"$f":"0","v":0},null,null,null,null,null,null,null,null,"these are the offsets added to the Max-Avg readings to add a baseline to the peak values on the chart"]
["2024-04-23T10:40:00",8,15,33,0,6,4,27,0,14,30,38,0,56,null,null,null,null,null,null,null,{"$f":"connected_load_plot+J15-B15","v":48},{"$f":"connected_load_plot+K15-C15","v":57},{"$f":"connected_load_plot+L15-D15","v":47},{"$f":"0","v":0},null,null,null,null,null,null,null,null,"they need to be subtracted from the max values of the plotted Peak-Avg curves"]
["2024-04-23T10:45:00",9,14,36,0,6,4,27,0,19,30,44,0,59,null,null,null,null,null,null,null,{"$f":"connected_load_plot+J16-B16","v":52},{"$f":"connected_load_plot+K16-C16","v":58},{"$f":"connected_load_plot+L16-D16","v":50},{"$f":"0","v":0}]
["2024-04-23T10:50:00",7,14,34,0,6,4,27,0,13,30,44,0,55,null,null,null,null,null,null,null,{"$f":"connected_load_plot+J17-B17","v":48},{"$f":"connected_load_plot+K17-C17","v":58},{"$f":"connected_load_plot+L17-D17","v":52},{"$f":"0","v":0}]
["2024-04-23T10:55:00",9,14,35,0,6,4,27,0,19,30,44,0,58,null,null,null,null,null,null,null,{"$f":"connected_load_plot+J18-B18","v":52},{"$f":"connected_load_plot+K18-C18","v":58},{"$f":"connected_load_plot+L18-D18","v":51},{"$f":"0","v":0}]
["2024-04-23T11:00:00",8,12,35,0,6,3,26,0,19,24,44,0,55,null,null,null,null,null,null,null,{"$f":"connected_load_plot+J19-B19","v":53},{"$f":"connected_load_plot+K19-C19","v":54},{"$f":"connected_load_plot+L19-D19","v":51},{"$f":"0","v":0},null,null,0,0,null,"additional load"]
["2024-04-23T11:05:00",8,12,34,0,6,3,26,0,14,23,44,0,54,null,null,null,null,null,null,null,{"$f":"connected_load_plot+J20-B20","v":48},{"$f":"connected_load_plot+K20-C20","v":53},{"$f":"connected_load_plot+L20-D20","v":52},{"$f":"0","v":0},null,null,0,0,null,"seasonal_adjust"]
["2024-04-23T11:10:00",7,12,35,0,6,3,26,0,13,23,44,0,54,null,null,null,null,null,null,null,{"$f":"connected_load_plot+J21-B21","v":48},{"$f":"connected_load_plot+K21-C21","v":53},{"$f":"connected_load_plot+L21-D21","v":51},{"$f":"0","v":0}]
["2024-04-23T11:15:00",6,12,35,0,6,3,27,0,9,23,46,0,53,null,null,null,null,null,null,null,{"$f":"connected_load_plot+J22-B22","v":45},{"$f":"connected_load_plot+K22-C22","v":53},{"$f":"connected_load_plot+L22-D22","v":53},{"$f":"0","v":0}]
["2024-04-23T11:20:00",7,13,33,0,6,3,26,0,12,23,39,0,53,null,null,null,null,null,null,null,{"$f":"connected_load_plot+J23-B23","v":47},{"$f":"connected_load_plot+K23-C23","v":52},{"$f":"connected_load_plot+L23-D23","v":48},{"$f":"0","v":0}]
["2024-04-23T11:25:00",6,12,35,0,6,3,26,0,8,23,44,0,53,null,null,null,null,null,null,null,{"$f":"connected_load_plot+J24-B24","v":44},{"$f":"connected_load_plot+K24-C24","v":53},{"$f":"connected_load_plot+L24-D24","v":51},{"$f":"0","v":0}]
["2024-04-23T11:30:00",7,12,35,0,6,3,27,0,19,23,44,0,54,null,null,null,null,null,null,null,{"$f":"connected_load_plot+J25-B25","v":54},{"$f":"connected_load_plot+K25-C25","v":53},{"$f":"connected_load_plot+L25-D25","v":51},{"$f":"0","v":0}]
["2024-04-23T11:35:00",6,12,33,0,6,3,26,0,9,23,39,0,51,null,null,null,null,null,null,null,{"$f":"connected_load_plot+J26-B26","v":45},{"$f":"connected_load_plot+K26-C26","v":53},{"$f":"connected_load_plot+L26-D26","v":48},{"$f":"0","v":0}]
["2024-04-23T11:40:00",7,12,31,0,6,3,25,0,12,16,42,0,50,null,null,null,null,null,null,null,{"$f":"connected_load_plot+J27-B27","v":47},{"$f":"connected_load_plot+K27-C27","v":46},{"$f":"connected_load_plot+L27-D27","v":53},{"$f":"0","v":0}]
["2024-04-23T11:45:00",6,11,33,0,6,3,25,0,8,23,43,0,50,null,null,null,null,null,null,null,{"$f":"connected_load_plot+J28-B28","v":44},{"$f":"connected_load_plot+K28-C28","v":54},{"$f":"connected_load_plot+L28-D28","v":52},{"$f":"0","v":0},null,null,"Projected Demand for plotting"]
["2024-04-23T11:50:00",7,12,32,0,6,2,24,0,13,22,42,0,51,null,null,null,null,null,null,null,{"$f":"connected_load_plot+J29-B29","v":48},{"$f":"connected_load_plot+K29-C29","v":52},{"$f":"connected_load_plot+L29-D29","v":52},{"$f":"0","v":0},null,null,null,{"$f":"NEC!J19","v":42}]
["2024-04-23T11:55:00",6,13,31,0,6,2,24,0,12,28,42,0,50,null,null,null,null,null,null,null,{"$f":"connected_load_plot+J30-B30","v":48},{"$f":"connected_load_plot+K30-C30","v":57},{"$f":"connected_load_plot+L30-D30","v":53},{"$f":"0","v":0}]
{"$rows_left_out":2057}
{"sheet":"NEC","index":10,"n_rows":36,"n_cols":11,"rows_kept":36,"cut":false,"hidden":true,"merged":[[15,2,15,5],[5,2,5,5],[11,2,11,5],[12,2,12,5],[17,2,17,5],[6,2,6,4],[6,5,7,5],[8,1,8,5],[6,1,7,1],[16,1,16,5],[0,2,0,5],[1,2,1,5],[2,2,2,5],[3,2,3,5],[4,2,4,5]]}
[null,"Circuit Name",{"$f":"title","v":0}]
["A","Location",{"$f":"location1","v":0}]
[null,"Panel Rating",{"$f":"panel_capacity","v":200}]
["B","Circuit Breaker Rating",{"$f":"panel_capacity","v":200}]
["C",{"$f":"temp_rating_desc","v":"90% of Rating (40C)"},{"$f":"panel_capacity*temp_rating_pc/100","v":180}]
["V","Nominal Voltage (Volts)",{"$f":"nominal_voltage","v":230}]
[null,null,"phase",null,null,"based on highest loaded phase"]
[null,null,"A","B","C",null,null,null,null,"to plot","(see nec_phase_sel on Control tab)"]
[null,"Demand Study"]
["D","Current Demand (CD)",{"$f":"'NEC Report Template'!I40","v":27},{"$f":"'NEC Report Template'!J40","v":28},{"$f":"'NEC Report Template'!K40","v":42},{"$f":"MAX(C10:E10)","v":42},"A",null,null,{"$f":"INDEX('NEC Report Template'!I40:L40,1,nec_phase_sel)","v":42}]
["E","Maximum Apparent Power",{"$f":"C10*$C6/1000","v":6.21},{"$f":"D10*$C6/1000","v":6.44},{"$f":"E10*$C6/1000","v":9.66},{"$f":"MAX(C11:E11)","v":9.66},"kVA","E = D x V /1000"]
["S","Maximum Demand (load)",{"$f":"SUM(C11:E11)","v":22.310000000000002},null,null,null,"kVA","S = Sum(E)"]
["F",{"$f":"'NEC Report Template'!B43","v":"Seasonal Adjustments"},{"$f":"IF(seasonal_en,seasonal_adjust,0)","v":0},null,null,null,"A"]
["H",{"$f":"'NEC Report Template'!B44","v":"Total Current Demand"},{"$f":"C10+IF(seasonal_en,seasonal_adjust)","v":27},{"$f":"D10+IF(seasonal_en,seasonal_adjust)","v":28},{"$f":"E10+IF(seasonal_en,seasonal_adjust)","v":42},{"$f":"MAX(C14:E14)","v":42},"A","H = D + F",null,{"$f":"INDEX(C14:F14,1,nec_phase_sel)","v":42}]
["L","Available Capacity",{"$f":"nec_main_breaker-nec_connected_load_a","v":173},{"$f":"nec_main_breaker-nec_connected_load_b","v":172},{"$f":"nec_main_breaker-nec_connected_load_c","v":158},{"$f":"MIN(C15:E15)","v":158},"A","L = B - H",null,{"$f":"INDEX($C$14:$F$14,1,nec_phase_sel)","v":42}]
["T","Free Capacity",{"$f":"nominal_voltage*SUM(C15:E15)/1000","v":115.69},null,null,null,"kVA","T = V x Sum(L)/1000"]
[null,"Plan/Projected Demand Analysis"]
["M","Planned Additional Demand",{"$f":"IF(planned_load_en,planned_load,0)","v":0},null,null,null,"A",null,null,"wait until the Wizard step that includes the Projected Load box before including Projected Load in the CONNECTED LOAD plot"]
["N","Projected Current Demand w/addition",{"$f":"nec_connected_load_a+$C$18","v":27},{"$f":"nec_connected_load_b+$C$18","v":28},{"$f":"nec_connected_load_c+$C$18","v":42},{"$f":"MAX(C19:E19)","v":42},"A","N = H + M",null,{"$f":"INDEX(C19:F19,1,nec_phase_sel)","v":42}]
["O","Projected Remaining Capacity",{"$f":"pcbr-C19","v":173},{"$f":"pcbr-D19","v":172},{"$f":"pcbr-E19","v":158},{"$f":"MIN(C20:E20)","v":158},"A","O = B - N"]
[]
[]
[]
[null,"NB. in general, the main formulae for the calcuations in this table should be on the \"NEC Report Template\" sheet"]
[null,"and the values on this sheet should be copies of (or make reference to) cells on that sheet (not the other way around, otherwise the generated reports will have links to this generator)"]
[]
[]
[]
[]
[null,"Total Capacity (based on 100% of breaker rating and specified Voltage)",{"$f":"nec_main_breaker*C6*3/1000","v":138},null,null,null,"kVA"]
{"$rows_left_out":6}